Target
Serine protease 1
Ligand
BDBM50112494
Substrate
Meas. Tech.
ChEBML_213077
Ki
3±n/a nM
Citation
 Shaw, KJGuilford, WJGriedel, BDSakata, STrinh, LWu, SXu, WZhao, ZMorrissey, MM Benzimidazole-based fXa inhibitors with improved thrombin and trypsin selectivity. Bioorg Med Chem Lett 12:1311-4 (2002)  
Target
Name:
Serine protease 1
Synonyms:
Alpha-trypsin chain 1 Beta-trypsin PRSS1 TRP1 TRY1_HUMAN Thrombin & trypsin Trypsin I | Trypsin-1
Type:
Enzyme
Mol. Mass.:
26557.80
Organism:
Homo sapiens (Human)
Description:
P07477
Residue:
247
  
Inhibitor
Name:
BDBM50112494
Synonyms:
7-{5-[1-(1-Imino-ethyl)-piperidin-4-yloxy]-2-methyl-4-nitro-benzoimidazol-1-ylmethyl}-naphthalene-2-carboxamidine | CHEMBL25351
Type:
Small organic molecule
Emp. Form.:
C27H29N7O3
Mol. Mass.:
499.5643
SMILES:
CC([NH-])=[N+]1CCC(CC1)Oc1ccc2n(Cc3ccc4ccc(cc4c3)C(N)=N)c(C)nc2c1[N+]([O-])=O
: