Target
Prostaglandin G/H synthase 1
Ligand
BDBM50451528
Substrate
Meas. Tech.
ChEBML_159409
IC50
>80000±n/a nM
Citation
 Kozak, KRPrusakiewicz, JJRowlinson, SWMarnett, LJ Enantiospecific, selective cyclooxygenase-2 inhibitors. Bioorg Med Chem Lett 12:1315-8 (2002)  
Target
Name:
Prostaglandin G/H synthase 1
Synonyms:
COX1 Cyclooxygenase-1 (COX-1) PTGS1 | Prostaglandin G/H synthase (cyclooxygenase)
Type:
Protein
Mol. Mass.:
68868.60
Organism:
Ovis aries (Sheep)
Description:
Residue:
600
  
Inhibitor
Name:
BDBM50451528
Synonyms:
CHEMBL2115305
Type:
Small organic molecule
Emp. Form.:
C24H26ClN3O4
Mol. Mass.:
455.934
SMILES:
COc1ccc2n(C(=O)c3ccc(Cl)cc3)c(C)c(CC(=O)NN3CCC[C@@H]3CO)c2c1
: