Target
Inosine-5'-monophosphate dehydrogenase 2
Ligand
BDBM50112568
Substrate
Meas. Tech.
ChEBML_89804
IC50
55.0±n/a nM
Citation
 Gu, HHIwanowicz, EJGuo, JWatterson, SHShen, ZPitts, WJDhar, TGFleener, CARouleau, KSherbina, NZWitmer, MTredup, JHollenbaugh, D Novel diamide-based inhibitors of IMPDH. Bioorg Med Chem Lett 12:1323-6 (2002)  
Target
Name:
Inosine-5'-monophosphate dehydrogenase 2
Synonyms:
IMDH2_HUMAN IMPD 2 IMPDH-II Inosine 5'-monophosphate dehydrogenase II (IMPDH II) Inosine-5 -monophosphate dehydrogenase 2 | Inosine-5'-monophosphate dehydrogenase (IMPDH)
Type:
Enzyme
Mol. Mass.:
55806.87
Organism:
Homo sapiens (Human)
Description:
Recombinant IMPDH2 expressed in E. coli.
Residue:
514
  
Inhibitor
Name:
BDBM50112568
Synonyms:
CHEMBL24092 | N-tert-Butyl-N'-(3-chloro-4-oxazol-5-yl-phenyl)-oxalamide
Type:
Small organic molecule
Emp. Form.:
C15H16ClN3O3
Mol. Mass.:
321.759
SMILES:
CC(C)(C)NC(=O)C(=O)Nc1ccc(-c2cnco2)c(Cl)c1
: