Target
Arginase-1
Ligand
BDBM55121
Substrate
Meas. Tech.
ChEMBL_2045302 (CHEMBL4700001)
IC50
128000±n/a nM
Citation
 Muller, JCardey, BZedet, ADesingle, CGrzybowski, MPomper, PFoley, SHarakat, DRamseyer, CGirard, CPudlo, M Synthesis, evaluation and molecular modelling of piceatannol analogues as arginase inhibitors. RSC Med Chem 11:559-568 (2020)  
Target
Name:
Arginase-1
Synonyms:
ARG1 Liver-type arginase | Type I arginase
Type:
PROTEIN
Mol. Mass.:
35008.90
Organism:
Bos taurus
Description:
ChEMBL_474406
Residue:
322
  
Inhibitor
Name:
BDBM55121
Synonyms:
3-HYDROXYTYRAMINE HYDROCHLORIDE 4-(2-aminoethyl)pyrocatechol;hydrochloride Dopamine SMR000059081 | cid_65340
Type:
Small organic molecule
Emp. Form.:
C8H11NO2
Mol. Mass.:
153.1784
SMILES:
NCCc1ccc(O)c(O)c1
: