Target
Coagulation factor X
Ligand
BDBM50114540
Substrate
Meas. Tech.
ChEBML_49305
Ki
0.800000±n/a nM
Citation
 Guertin, KRGardner, CJKlein, SIZulli, ALCzekaj, MGong, YSpada, APCheney, DLMaignan, SGuilloteau, JPBrown, KDColussi, DJChu, VHeran, CLMorgan, SRBentley, RGDunwiddie, CTLeadley, RJPauls, HW Optimization of the beta-aminoester class of factor Xa inhibitors. Part 2: Identification of FXV673 as a potent and selective inhibitor with excellent In vivo anticoagulant activity. Bioorg Med Chem Lett 12:1671-4 (2002)  
Target
Name:
Coagulation factor X
Synonyms:
Activated coagulation factor X (FXa) Coagulation factor X precursor F10 Factor X heavy chain Factor Xa Stuart-Prower factor
Type:
Enzyme
Mol. Mass.:
54726.60
Organism:
Homo sapiens (Human)
Description:
Residue:
488
  
Inhibitor
Name:
BDBM50114540
Synonyms:
3-{4-[(1R,2R)-3-(3-Carbamimidoyl-phenyl)-2-methoxycarbonyl-1-methyl-propylcarbamoyl]-phenyl}-1-methyl-pyridinium | CHEMBL295454
Type:
Small organic molecule
Emp. Form.:
C26H29N4O3
Mol. Mass.:
445.5329
SMILES:
COC(=O)[C@H](Cc1cccc(c1)C(N)=N)[C@@H](C)NC(=O)c1ccc(cc1)-c1ccc[n+](C)c1
: