Target
Coagulation factor X
Ligand
BDBM50085406
Substrate
Meas. Tech.
ChEBML_49305
Ki
5.3±n/a nM
Citation
 Guertin, KRGardner, CJKlein, SIZulli, ALCzekaj, MGong, YSpada, APCheney, DLMaignan, SGuilloteau, JPBrown, KDColussi, DJChu, VHeran, CLMorgan, SRBentley, RGDunwiddie, CTLeadley, RJPauls, HW Optimization of the beta-aminoester class of factor Xa inhibitors. Part 2: Identification of FXV673 as a potent and selective inhibitor with excellent In vivo anticoagulant activity. Bioorg Med Chem Lett 12:1671-4 (2002)  
Target
Name:
Coagulation factor X
Synonyms:
Activated coagulation factor X (FXa) Coagulation factor X precursor F10 Factor X heavy chain Factor Xa Stuart-Prower factor
Type:
Enzyme
Mol. Mass.:
54726.60
Organism:
Homo sapiens (Human)
Description:
Residue:
488
  
Inhibitor
Name:
BDBM50085406
Synonyms:
(2R,3R)-3-[(Biphenyl-4-carbonyl)-amino]-2-(3-carbamimidoyl-benzyl)-butyric acid methyl ester | CHEMBL45000
Type:
Small organic molecule
Emp. Form.:
C26H27N3O3
Mol. Mass.:
429.5109
SMILES:
COC(=O)[C@H](Cc1cccc(c1)C(N)=N)[C@@H](C)NC(=O)c1ccc(cc1)-c1ccccc1
: