Target
Neutrophil elastase
Ligand
BDBM420298
Substrate
Meas. Tech.
ChEMBL_2049050 (CHEMBL4703749)
IC50
>10000±n/a nM
Citation
 Hoffman, RLKania, RSBrothers, MADavies, JFFerre, RAGajiwala, KSHe, MHogan, RJKozminski, KLi, LYLockner, JWLou, JMarra, MTMitchell, LJMurray, BWNieman, JANoell, SPlanken, SPRowe, TRyan, KSmith, GJSolowiej, JESteppan, CMTaggart, B Discovery of Ketone-Based Covalent Inhibitors of Coronavirus 3CL Proteases for the Potential Therapeutic Treatment of COVID-19. J Med Chem 63:12725-12747 (2020)  
Target
Name:
Neutrophil elastase
Synonyms:
Bone marrow serine protease Coagulation factor X ELANE Elastase HLE Leukocyte elastase Medullasin Neutrophil elastase (HNE) PMN elastase Trypsin
Type:
Enzyme
Mol. Mass.:
28532.38
Organism:
Homo sapiens (Human)
Description:
P08246
Residue:
267
  
Inhibitor
Name:
BDBM420298
Synonyms:
CVD-0006356 PF-0835231 US11753373, Compound A-5-d WO2021205298, Compound 1 | cmdc.202100576, 6b
Type:
Small organic molecule
Emp. Form.:
C24H32N4O6
Mol. Mass.:
472.5341
SMILES:
COc1cccc2[nH]c(cc12)C(=O)N[C@@H](CC(C)C)C(=O)N[C@@H](C[C@@H]1CCNC1=O)C(=O)CO
: