Target
Gag-Pol polyprotein [489-587]
Ligand
BDBM420298
Substrate
Meas. Tech.
ChEMBL_2049060 (CHEMBL4703759)
IC50
>10000±n/a nM
Citation
 Hoffman, RLKania, RSBrothers, MADavies, JFFerre, RAGajiwala, KSHe, MHogan, RJKozminski, KLi, LYLockner, JWLou, JMarra, MTMitchell, LJMurray, BWNieman, JANoell, SPlanken, SPRowe, TRyan, KSmith, GJSolowiej, JESteppan, CMTaggart, B Discovery of Ketone-Based Covalent Inhibitors of Coronavirus 3CL Proteases for the Potential Therapeutic Treatment of COVID-19. J Med Chem 63:12725-12747 (2020)  
Target
Name:
Gag-Pol polyprotein [489-587]
Synonyms:
Human immunodeficiency virus type 1 protease Pol polyprotein | gag-pol
Type:
Enzyme Subunit
Mol. Mass.:
10781.16
Organism:
Human immunodeficiency virus type 1
Description:
P04585[489-587]
Residue:
99
  
Inhibitor
Name:
BDBM420298
Synonyms:
CVD-0006356 PF-0835231 US11753373, Compound A-5-d WO2021205298, Compound 1 | cmdc.202100576, 6b
Type:
Small organic molecule
Emp. Form.:
C24H32N4O6
Mol. Mass.:
472.5341
SMILES:
COc1cccc2[nH]c(cc12)C(=O)N[C@@H](CC(C)C)C(=O)N[C@@H](C[C@@H]1CCNC1=O)C(=O)CO
: