Target
Melanocyte-stimulating hormone receptor
Ligand
BDBM50115293
Substrate
Meas. Tech.
ChEMBL_104587 (CHEMBL715332)
IC50
0.160000±n/a nM
Citation
 Cheng, ZChen, JMiao, YOwen, NKQuinn, TPJurisson, SS Modification of the structure of a metallopeptide: synthesis and biological evaluation of (111)In-labeled DOTA-conjugated rhenium-cyclized alpha-MSH analogues. J Med Chem 45:3048-56 (2002)  
Target
Name:
Melanocyte-stimulating hormone receptor
Synonyms:
MC1-R Mc1r Melanocyte-stimulating hormone receptor | Msh-r
Type:
PROTEIN
Mol. Mass.:
35238.60
Organism:
Mus musculus
Description:
ChEMBL_1498846
Residue:
315
  
Inhibitor
Name:
BDBM50115293
Synonyms:
CHEMBL436773 | DOTA-ReCCEHdFRWCKPV-OH
Type:
Small organic molecule
Emp. Form.:
C75H106N24O22ReS3
Mol. Mass.:
1978.195
SMILES:
CC(C)C(NC(=O)C1CCCN1C(=O)C(CCCNC(N)=N)NC(=O)C1NC(=O)C(Cc2c[nH]c3ccccc23)NC(=O)C(CCCNC(N)=N)NC(=O)[C@H](Cc2ccccc2)NC(=O)C(Cc2cnc[nH]2)NC(=O)C(CCC(O)=O)NC(=O)C2S[Re-]3([O-])(SC(NC(=O)CN4CCN(CC(O)=O)CCN(CC(O)=O)CCN(CC(O)=O)CC4)C(=O)N23)S1)C(O)=O
: