Target
Platelet-derived growth factor receptor beta
Ligand
BDBM50115306
Substrate
Meas. Tech.
ChEMBL_158524 (CHEMBL768951)
IC50
110±n/a nM
Citation
 Matsuno, KIchimura, MNakajima, TTahara, KFujiwara, SKase, HUshiki, JGiese, NAPandey, AScarborough, RMLokker, NAYu, JCIrie, JTsukuda, EIde, SOda, SNomoto, Y Potent and selective inhibitors of platelet-derived growth factor receptor phosphorylation. 1. Synthesis, structure-activity relationship, and biological effects of a new class of quinazoline derivatives. J Med Chem 45:3057-66 (2002)  
Target
Name:
Platelet-derived growth factor receptor beta
Synonyms:
Beta-type platelet-derived growth factor receptor CD140b antigen PDGF Receptor Substrate PDGFR PDGFR-1 PDGFRB PGFRB_HUMAN Platelet-derived growth factor receptor 1 Platelet-derived growth factor receptor beta (PDGFR-beta) Platelet-derived growth factor receptor beta (PDGFRbeta) | VHL/PDGFRB
Type:
Enzyme
Mol. Mass.:
123922.25
Organism:
Homo sapiens (Human)
Description:
P09619
Residue:
1106
  
Inhibitor
Name:
BDBM50115306
Synonyms:
4-(6,7-Dimethoxy-quinazolin-4-yl)-piperazine-1-carboxylic acid (4-propyl-phenyl)-amide | CHEMBL102686
Type:
Small organic molecule
Emp. Form.:
C24H29N5O3
Mol. Mass.:
435.5188
SMILES:
CCCc1ccc(NC(=O)N2CCN(CC2)c2ncnc3cc(OC)c(OC)cc23)cc1
: