Target
5-hydroxytryptamine receptor 2A
Ligand
BDBM50115643
Substrate
Meas. Tech.
ChEMBL_2679 (CHEMBL617927)
Ki
0.7±n/a nM
Citation
 Wikström, HVMensonides-Harsema, MMCremers, TIMoltzen, EKArnt, J Synthesis and pharmacological testing of 1,2,3,4,10,14b-hexahydro-6-methoxy-2-methyldibenzo[c,f]pyrazino[1,2-a]azepin and its enantiomers in comparison with the two antidepressants mianserin and mirtazapine. J Med Chem 45:3280-5 (2002)  
Target
Name:
5-hydroxytryptamine receptor 2A
Synonyms:
5-HT-2A 5-HT2A 5-hydroxytryptamine receptor 2A (5HT2A) Htr2 Serotonin Receptor 2A
Type:
G Protein-Coupled Receptor (GPCR)
Mol. Mass.:
52852.05
Organism:
Rattus norvegicus (rat)
Description:
Rat cortex membranes 5-HT2A receptors.
Residue:
471
  
Inhibitor
Name:
BDBM50115643
Synonyms:
(+/-)-6 5-Methoxy-2-methyl-1,2,3,4,9,13b-hexahydro-2,4a-diaza-tribenzo[a,c,e]cycloheptene | CHEMBL324270
Type:
Small organic molecule
Emp. Form.:
C19H22N2O
Mol. Mass.:
294.3908
SMILES:
COc1cccc2Cc3ccccc3C3CN(C)CCN3c12
: