Target
Endothelin-converting enzyme 1
Ligand
BDBM50115843
Substrate
Meas. Tech.
ChEBML_64199
Ki
18±n/a nM
Citation
 Inguimbert, NPoras, HTeffo, FBeslot, FSelkti, MTomas, AScalbert, EBennejean, CRenard, PFournié-Zaluski, MCRoques, BP N-[2-(Indan-1-yl)-3-mercapto-propionyl] amino acids as highly potent inhibitors of the three vasopeptidases (NEP, ACE, ECE): In vitro and In vivo activities. Bioorg Med Chem Lett 12:2001-5 (2002)  
Target
Name:
Endothelin-converting enzyme 1
Synonyms:
ECE-1 ECE1_HUMAN Endothelin-converting enzyme 1 (ECE1)
Type:
Enzyme
Mol. Mass.:
87155.11
Organism:
Homo sapiens (Human)
Description:
P42892
Residue:
770
  
Inhibitor
Name:
BDBM50115843
Synonyms:
(2S)-2-[(2R)-2-[(1R)-5-bromo-2,3-dihydro-1H-inden-1-yl]-3-sulfanylpropanamido]-3-(1H-indol-3-yl)propanoic acid | CHEMBL301646
Type:
Small organic molecule
Emp. Form.:
C23H23BrN2O3S
Mol. Mass.:
487.409
SMILES:
OC(=O)[C@H](Cc1c[nH]c2ccccc12)NC(=O)[C@H](CS)[C@H]1CCc2cc(Br)ccc12
: