Target
Angiotensin-converting enzyme
Ligand
BDBM50115850
Substrate
Meas. Tech.
ChEBML_35382
Ki
4.6±n/a nM
Citation
 Inguimbert, NPoras, HTeffo, FBeslot, FSelkti, MTomas, AScalbert, EBennejean, CRenard, PFournié-Zaluski, MCRoques, BP N-[2-(Indan-1-yl)-3-mercapto-propionyl] amino acids as highly potent inhibitors of the three vasopeptidases (NEP, ACE, ECE): In vitro and In vivo activities. Bioorg Med Chem Lett 12:2001-5 (2002)  
Target
Name:
Angiotensin-converting enzyme
Synonyms:
ACE_RAT Angiotensin-converting enzyme | Dcp1
Type:
PROTEIN
Mol. Mass.:
150907.81
Organism:
Rattus norvegicus
Description:
ChEMBL_35219
Residue:
1313
  
Inhibitor
Name:
BDBM50115850
Synonyms:
(S)-3-(1H-Indol-3-yl)-2-[(S)-3-mercapto-2-((R)-5-methoxy-indan-1-yl)-propionylamino]-propionic acid | CHEMBL304629
Type:
Small organic molecule
Emp. Form.:
C24H26N2O4S
Mol. Mass.:
438.539
SMILES:
COc1ccc2[C@H](CCc2c1)[C@H](CS)C(=O)N[C@@H](Cc1c[nH]c2ccccc12)C(O)=O
: