Target
Coagulation factor X
Ligand
BDBM50115857
Substrate
Meas. Tech.
ChEBML_49126
Ki
2400±n/a nM
Citation
 Mackman, RLHui, HCBreitenbucher, JGKatz, BALuong, CMartelli, AMcGee, DRadika, KSendzik, MSpencer, JRSprengeler, PATario, JVerner, EWang, J 2-(2-Hydroxy-3-alkoxyphenyl)-1H-benzimidazole-5-carboxamidine derivatives as potent and selective urokinase-type plasminogen activator inhibitors. Bioorg Med Chem Lett 12:2019-22 (2002)  
Target
Name:
Coagulation factor X
Synonyms:
Activated coagulation factor X (FXa) Coagulation factor X precursor F10 Factor X heavy chain Factor Xa Stuart-Prower factor
Type:
Enzyme
Mol. Mass.:
54726.60
Organism:
Homo sapiens (Human)
Description:
Residue:
488
  
Inhibitor
Name:
BDBM50115857
Synonyms:
2-(2-Hydroxy-3-isobutoxy-phenyl)-1H-benzoimidazole-5-carboxamidine CHEMBL64676
Type:
Small organic molecule
Emp. Form.:
C18H20N4O2
Mol. Mass.:
324.377
SMILES:
CC(C)COc1cccc(-c2nc3ccc(cc3[nH]2)C(N)=N)c1O
: