Target
Prothrombin
Ligand
BDBM50115870
Substrate
Meas. Tech.
ChEBML_208917
Ki
31000±n/a nM
Citation
 Mackman, RLHui, HCBreitenbucher, JGKatz, BALuong, CMartelli, AMcGee, DRadika, KSendzik, MSpencer, JRSprengeler, PATario, JVerner, EWang, J 2-(2-Hydroxy-3-alkoxyphenyl)-1H-benzimidazole-5-carboxamidine derivatives as potent and selective urokinase-type plasminogen activator inhibitors. Bioorg Med Chem Lett 12:2019-22 (2002)  
Target
Name:
Prothrombin
Synonyms:
Activation peptide fragment 1 Coagulation factor II Prothrombin precursor Thrombin heavy chain | Thrombin light chain
Type:
Protein
Mol. Mass.:
70029.57
Organism:
Homo sapiens (Human)
Description:
P00734
Residue:
622
  
Inhibitor
Name:
BDBM50115870
Synonyms:
2-(3-Ethoxy-2-hydroxy-phenyl)-1H-benzoimidazole-5-carboxamidine | CHEMBL64838
Type:
Small organic molecule
Emp. Form.:
C16H16N4O2
Mol. Mass.:
296.3238
SMILES:
CCOc1cccc(-c2nc3ccc(cc3[nH]2)C(N)=N)c1O
: