Target
Inosine-5'-monophosphate dehydrogenase 2
Ligand
BDBM50116124
Substrate
Meas. Tech.
ChEBML_89931
IC50
76±n/a nM
Citation
 Pitts, WJGuo, JDhar, TGShen, ZGu, HHWatterson, SHBednarz, MSChen, BCBarrish, JCBassolino, DCheney, DFleener, CARouleau, KAHollenbaugh, DLIwanowicz, EJ Rapid synthesis of triazine inhibitors of inosine monophosphate dehydrogenase. Bioorg Med Chem Lett 12:2137-40 (2002)  
Target
Name:
Inosine-5'-monophosphate dehydrogenase 2
Synonyms:
IMDH2_HUMAN IMPD 2 IMPDH-II Inosine 5'-monophosphate dehydrogenase II (IMPDH II) Inosine-5 -monophosphate dehydrogenase 2 | Inosine-5'-monophosphate dehydrogenase (IMPDH)
Type:
Enzyme
Mol. Mass.:
55806.87
Organism:
Homo sapiens (Human)
Description:
Recombinant IMPDH2 expressed in E. coli.
Residue:
514
  
Inhibitor
Name:
BDBM50116124
Synonyms:
CHEMBL433062 | N-(3-Methoxy-4-oxazol-5-yl-phenyl)-N'-methyl-6-phenyl-[1,3,5]triazine-2,4-diamine
Type:
Small organic molecule
Emp. Form.:
C20H18N6O2
Mol. Mass.:
374.3959
SMILES:
CNc1nc(Nc2ccc(-c3cnco3)c(OC)c2)nc(n1)-c1ccccc1
: