Target
Cytochrome P450 3A4
Ligand
BDBM26197
Substrate
Meas. Tech.
ChEMBL_2053312 (CHEMBL4708313)
IC50
>10000±n/a nM
Citation
 Bazan, HABhattacharjee, SBurgos, CRecio, JAbet, VPahng, ARJun, BHeap, JLedet, AJGordon, WCEdwards, SPaul, DAlvarez-Builla, JBazan, NG A novel pipeline of 2-(benzenesulfonamide)-N-(4-hydroxyphenyl) acetamide analgesics that lack hepatotoxicity and retain antipyresis. Eur J Med Chem 202:0 (2020)  
Target
Name:
Cytochrome P450 3A4
Synonyms:
Albendazole monooxygenase CP3A4_HUMAN CYP3A4 CYPIIIA4 Cytochrome P450 3A4 (CYP3A4) Nifedipine oxidase Taurochenodeoxycholate 6-alpha-hydroxylase
Type:
Enzyme
Mol. Mass.:
57349.57
Organism:
Homo sapiens (Human)
Description:
Residue:
503
  
Inhibitor
Name:
BDBM26197
Synonyms:
CHEMBL112 Norco US9333197, Acetaminophen phenol derivative, 11
Type:
Small organic molecule
Emp. Form.:
C8H9NO2
Mol. Mass.:
151.1626
SMILES:
CC(=O)Nc1ccc(O)cc1
: