Target
Neuropeptide Y receptor type 5
Ligand
BDBM50116597
Substrate
Meas. Tech.
ChEMBL_143678 (CHEMBL755166)
IC50
7±n/a nM
Citation
 Block, MHBoyer, SBrailsford, WBrittain, DRCarroll, DChapman, SClarke, DSDonald, CSFoote, KMGodfrey, LLadner, AMarsham, PRMasters, DJMee, CDO'Donovan, MRPease, JEPickup, AGRayner, JWRoberts, ASchofield, PSuleman, ATurnbull, AV Discovery and optimization of a series of carbazole ureas as NPY5 antagonists for the treatment of obesity. J Med Chem 45:3509-23 (2002)  
Target
Name:
Neuropeptide Y receptor type 5
Synonyms:
NPY-Y5 NPY5-R NPY5R_HUMAN NPYY5 Neuropeptide Y receptor type 5 ( NPY Y5) | Y5 receptor
Type:
Enzyme
Mol. Mass.:
50746.64
Organism:
Homo sapiens (Human)
Description:
Q15761
Residue:
445
  
Inhibitor
Name:
BDBM50116597
Synonyms:
CHEMBL119247 | Morpholine-4-carboxylic acid (9-ethyl-9H-carbazol-3-yl)-amide
Type:
Small organic molecule
Emp. Form.:
C19H21N3O2
Mol. Mass.:
323.3889
SMILES:
CCn1c2ccccc2c2cc(NC(=O)N3CCOCC3)ccc12
: