Target
Neuromedin-K receptor
Ligand
BDBM50116717
Substrate
Meas. Tech.
ChEBML_209564
Ki
0.300000±n/a nM
Citation
 Reichard, GAGrice, CAShih, NYSpitler, JMajmundar, SWang, SDPaliwal, SAnthes, JCPiwinski, JJ Preparation of oxime dual NK(1)/NK(2) antagonists with reduced NK(3) affinity. Bioorg Med Chem Lett 12:2355-8 (2002)  
Target
Name:
Neuromedin-K receptor
Synonyms:
NK-3 receptor NK3R NKR Neurokinin B receptor Neuromedin-3 receptor (NK-3R) Neuromedin-K receptor Neuromedin-K receptor (NK3) TAC3R Tachykinin receptor 3 | Tachykinin receptor 3 (NK3)
Type:
Enzyme
Mol. Mass.:
52221.96
Organism:
Homo sapiens (Human)
Description:
P29371
Residue:
465
  
Inhibitor
Name:
BDBM50116717
Synonyms:
3,5-Dichloro-N-[(R)-3-(3,4-dichloro-phenyl)-2-[(Z)-methoxyimino]-5-((R)-3-methylcarbamoylmethyl-2-oxo-[1,4']bipiperidinyl-1'-yl)-pentyl]-N-methyl-benzamide SCH-206272
Type:
Small organic molecule
Emp. Form.:
C33H41Cl4N5O4
Mol. Mass.:
713.522
SMILES:
CNC(=O)C[C@H]1CCCN(C2CCN(CC[C@@H](\C(CN(C)C(=O)c3cc(Cl)cc(Cl)c3)=N\OC)c3ccc(Cl)c(Cl)c3)CC2)C1=O
: