Target
Adenosine receptor A3
Ligand
BDBM50117109
Substrate
Meas. Tech.
ChEMBL_32020 (CHEMBL649056)
Ki
0.04±n/a nM
Citation
 Maconi, APastorin, GDa Ros, TSpalluto, GGao, ZGJacobson, KABaraldi, PGCacciari, BVarani, KMoro, SBorea, PA Synthesis, biological properties, and molecular modeling investigation of the first potent, selective, and water-soluble human A(3) adenosine receptor antagonist. J Med Chem 45:3579-82 (2002)  
Target
Name:
Adenosine receptor A3
Synonyms:
A3 adenosine receptor (hA3) ADORA3 | Adenosine A3 receptor (A3AR)
Type:
G Protein-Coupled Receptor (GPCR)
Mol. Mass.:
36197.32
Organism:
Homo sapiens (Human)
Description:
P0DMS8
Residue:
318
  
Inhibitor
Name:
BDBM50117109
Synonyms:
1-(2-Furan-2-yl-8-methyl-8H-pyrazolo[4,3-e][1,2,4]triazolo[1,5-c]pyrimidin-5-yl)-3-pyridin-4-yl-urea CHEMBL332091
Type:
Small organic molecule
Emp. Form.:
C17H13N9O2
Mol. Mass.:
375.3442
SMILES:
Cn1cc2c(n1)nc(NC(=O)Nc1ccncc1)n1nc(nc21)-c1ccco1
: