Target
C-C chemokine receptor type 1
Ligand
BDBM50007676
Substrate
Meas. Tech.
ChEMBL_49845 (CHEMBL660276)
IC50
>50000±n/a nM
Citation
 De Lucca, GVKim, UTJohnson, CVargo, BJWelch, PKCovington, MDavies, PSolomon, KANewton, RCTrainor, GLDecicco, CPKo, SS Discovery and structure-activity relationship of N-(ureidoalkyl)-benzyl-piperidines as potent small molecule CC chemokine receptor-3 (CCR3) antagonists. J Med Chem 45:3794-804 (2002)  
Target
Name:
C-C chemokine receptor type 1
Synonyms:
C-C CKR-1 CC-CKR-1 CCR1 CD_antigen=CD191 CMKR1 LD78 receptor Macrophage inflammatory protein 1-alpha receptor SCYAR1
Type:
Enzyme
Mol. Mass.:
41180.69
Organism:
Homo sapiens (Human)
Description:
P32246
Residue:
355
  
Inhibitor
Name:
BDBM50007676
Synonyms:
4-Benzyl-1-phenethyl-piperidine CHEMBL553596
Type:
Small organic molecule
Emp. Form.:
C20H25N
Mol. Mass.:
279.4192
SMILES:
C(Cc1ccccc1)N1CCC(Cc2ccccc2)CC1
: