Target
C-C chemokine receptor type 1
Ligand
BDBM50117399
Substrate
Meas. Tech.
ChEMBL_49845 (CHEMBL660276)
IC50
>50000±n/a nM
Citation
 De Lucca, GVKim, UTJohnson, CVargo, BJWelch, PKCovington, MDavies, PSolomon, KANewton, RCTrainor, GLDecicco, CPKo, SS Discovery and structure-activity relationship of N-(ureidoalkyl)-benzyl-piperidines as potent small molecule CC chemokine receptor-3 (CCR3) antagonists. J Med Chem 45:3794-804 (2002)  
Target
Name:
C-C chemokine receptor type 1
Synonyms:
C-C CKR-1 CC-CKR-1 CCR1 CD_antigen=CD191 CMKR1 LD78 receptor Macrophage inflammatory protein 1-alpha receptor SCYAR1
Type:
Enzyme
Mol. Mass.:
41180.69
Organism:
Homo sapiens (Human)
Description:
P32246
Residue:
355
  
Inhibitor
Name:
BDBM50117399
Synonyms:
1,4-Dibenzyl-piperidine | CHEMBL124457
Type:
Small organic molecule
Emp. Form.:
C19H23N
Mol. Mass.:
265.3926
SMILES:
C(C1CCN(Cc2ccccc2)CC1)c1ccccc1
: