Target
C-C chemokine receptor type 3
Ligand
BDBM50117399
Substrate
Meas. Tech.
ChEMBL_49848 (CHEMBL660813)
IC50
8300.0±n/a nM
Citation
 De Lucca, GVKim, UTJohnson, CVargo, BJWelch, PKCovington, MDavies, PSolomon, KANewton, RCTrainor, GLDecicco, CPKo, SS Discovery and structure-activity relationship of N-(ureidoalkyl)-benzyl-piperidines as potent small molecule CC chemokine receptor-3 (CCR3) antagonists. J Med Chem 45:3794-804 (2002)  
Target
Name:
C-C chemokine receptor type 3
Synonyms:
C-C CKR-3 CC-CKR-3 CCR3 CD_antigen=CD193 CMKBR3 | Eosinophil eotaxin receptor
Type:
Enzyme
Mol. Mass.:
41053.88
Organism:
Homo sapiens (Human)
Description:
P51677
Residue:
355
  
Inhibitor
Name:
BDBM50117399
Synonyms:
1,4-Dibenzyl-piperidine | CHEMBL124457
Type:
Small organic molecule
Emp. Form.:
C19H23N
Mol. Mass.:
265.3926
SMILES:
C(C1CCN(Cc2ccccc2)CC1)c1ccccc1
: