Target
G-protein coupled receptor 84
Ligand
BDBM50189549
Substrate
Meas. Tech.
ChEMBL_2057176 (CHEMBL4712177)
EC50
13±n/a nM
Citation
 Chen, LHZhang, QXie, XNan, FJ Modulation of the G-Protein-Coupled Receptor 84 (GPR84) by Agonists and Antagonists. J Med Chem 63:15399-15409 (2020)  
Target
Name:
G-protein coupled receptor 84
Synonyms:
G-protein coupled receptor 84 Gpr84
Type:
PROTEIN
Mol. Mass.:
43740.69
Organism:
Mus musculus
Description:
ChEMBL_119136
Residue:
396
  
Inhibitor
Name:
BDBM50189549
Synonyms:
CHEMBL3827756
Type:
Small organic molecule
Emp. Form.:
C10H16N2O2S
Mol. Mass.:
228.311
SMILES:
CCCCCCSc1nc(O)cc(O)n1
: