Target
Type-1 angiotensin II receptor B
Ligand
BDBM50091105
Substrate
Meas. Tech.
ChEMBL_34836 (CHEMBL648770)
Ki
>0.000100±n/a nM
Citation
 Murugesan, NTellew, JEGu, ZKunst, BLFadnis, LCornelius, LABaska, RAYang, YBeyer, SMMonshizadegan, HDickinson, KEPanchal, BValentine, MTChong, SMorrison, RACarlson, KEPowell, JRMoreland, SBarrish, JCKowala, MCMacor, JE Discovery of N-isoxazolyl biphenylsulfonamides as potent dual angiotensin II and endothelin A receptor antagonists. J Med Chem 45:3829-35 (2002)  
Target
Name:
Type-1 angiotensin II receptor B
Synonyms:
AGTRB_RAT Agtr1 Angiotensin II AT1B Angiotensin II type 1b (AT-1b) receptor Type-1B angiotensin II receptor
Type:
Enzyme Catalytic Domain
Mol. Mass.:
40929.44
Organism:
RAT
Description:
Angiotensin II AT1B 0 RAT::P29089
Residue:
359
  
Inhibitor
Name:
BDBM50091105
Synonyms:
4''-Oxazol-2-yl-biphenyl-2-sulfonic acid (3,4-dimethyl-isoxazol-5-yl)-amide 4'-Oxazol-2-yl-biphenyl-2-sulfonicacid(3,4-dimethyl-isoxazol-5-yl)-amide CHEMBL24461
Type:
Small organic molecule
Emp. Form.:
C20H17N3O4S
Mol. Mass.:
395.432
SMILES:
Cc1noc(NS(=O)(=O)c2ccccc2-c2ccc(cc2)-c2ncco2)c1C
: