Target
N-acyl-phosphatidylethanolamine-hydrolyzing phospholipase D
Ligand
BDBM50557066
Substrate
Meas. Tech.
ChEMBL_2057750 (CHEMBL4712751)
IC50
447±n/a nM
Citation
 Mock, EDKotsogianni, IDriever, WPFFonseca, CSVooijs, JMden Dulk, Hvan Boeckel, CAAvan der Stelt, M Structure-Activity Relationship Studies of Pyrimidine-4-Carboxamides as Inhibitors of  J Med Chem 64:481-515 (2021)  
Target
Name:
N-acyl-phosphatidylethanolamine-hydrolyzing phospholipase D
Synonyms:
3.1.4.54 N-acyl phosphatidylethanolamine phospholipase D NAPE-PLD NAPEP_MOUSE | Napepld
Type:
PROTEIN
Mol. Mass.:
45810.25
Organism:
Mus musculus
Description:
ChEMBL_105212
Residue:
396
  
Inhibitor
Name:
BDBM50557066
Synonyms:
CHEMBL4794048
Type:
Small organic molecule
Emp. Form.:
C24H31N5O2
Mol. Mass.:
421.5352
SMILES:
O[C@H]1CCN(C1)c1cc(nc(n1)N1CCC[C@H](C1)c1ccccc1)C(=O)NCC1CC1
: