Target
Syntenin-1
Ligand
BDBM50557293
Substrate
Meas. Tech.
ChEMBL_2058682 (CHEMBL4713683)
Ki
40±n/a nM
Citation
Target
Name:
Syntenin-1
Synonyms:
MDA-9 Melanoma differentiation-associated protein 9 SDCB1_HUMAN SYCL Syndecan-binding protein 1 TACIP18
Type:
PROTEIN
Mol. Mass.:
32447.55
Organism:
Homo sapiens
Description:
ChEMBL_120132
Residue:
298
  
Inhibitor
Name:
BDBM50557293
Synonyms:
CHEMBL4781637
Type:
Small organic molecule
Emp. Form.:
C56H80N16O18S
Mol. Mass.:
1297.396
SMILES:
CC[C@H](C)[C@H](NC(=O)[C@H](CC(O)=O)NC(=O)CNC(=O)[C@H](Cc1cnc[nH]1)NC(=O)[C@H](CS)NC(=O)[C@H](CCC(O)=O)NC(=O)[C@H](CC(C)C)NC(=O)[C@@H](NC(=O)[C@H](Cc1c[nH]c2ccccc12)NC(=O)[C@H](Cc1cnc[nH]1)NC(=O)[C@@H](N)CO)[C@@H](C)O)C(O)=O
: