Target
Syntenin-1
Ligand
BDBM50557299
Substrate
Meas. Tech.
ChEMBL_2058683 (CHEMBL4713684)
Ki
170±n/a nM
Citation
Target
Name:
Syntenin-1
Synonyms:
MDA-9 Melanoma differentiation-associated protein 9 SDCB1_HUMAN SYCL Syndecan-binding protein 1 TACIP18
Type:
PROTEIN
Mol. Mass.:
32447.55
Organism:
Homo sapiens
Description:
ChEMBL_120132
Residue:
298
  
Inhibitor
Name:
BDBM50557299
Synonyms:
CHEMBL4799812
Type:
Small organic molecule
Emp. Form.:
C60H89N13O16S
Mol. Mass.:
1280.491
SMILES:
[H][C@]12CS[C@@H](CCCCC(=O)NCCOCCOCC(=O)N[C@@H](CO)C(=O)N[C@@H](Cc3cnc[nH]3)C(=O)N[C@@H](Cc3c[nH]c4ccccc34)C(=O)N[C@H](C(=O)N[C@@H](C3CCCCC3)C(=O)N[C@@H](CC(O)=O)C(=O)N[C@@H]([C@@H](C)CC)C(O)=O)C(C)(C)C)[C@@]1([H])NC(=O)N2
: