Target
Alpha-1A adrenergic receptor
Ligand
BDBM50118702
Substrate
Meas. Tech.
ChEMBL_33279 (CHEMBL644239)
Ki
2000±n/a nM
Citation
 Altenbach, RJKhilevich, AMeyer, MDBuckner, SAMilicic, IDaza, AVBrune, MEO'Neill, ABGauvin, DMCain, JCNakane, MHolladay, MWWilliams, MBrioni, JDSullivan, JP N-[3-(1H-imidazol-4-ylmethyl)phenyl]ethanesulfonamide (ABT-866, 1),(1) a novel alpha(1)-adrenoceptor ligand with an enhanced in vitro and in vivo profile relative to phenylpropanolamine and midodrine. J Med Chem 45:4395-7 (2002)  
Target
Name:
Alpha-1A adrenergic receptor
Synonyms:
ADA1A_RAT Adra1c Alpha-1A adrenoceptor Alpha-1C adrenergic receptor | adrenergic Alpha1A
Type:
Protein
Mol. Mass.:
51620.15
Organism:
Rattus norvegicus (Rat)
Description:
P43140
Residue:
466
  
Inhibitor
Name:
BDBM50118702
Synonyms:
2-Amino-1-(2,5-dimethoxy-phenyl)-ethanol DESGLYMIDODRINE Proamatine
Type:
Small organic molecule
Emp. Form.:
C10H15NO3
Mol. Mass.:
197.231
SMILES:
COc1ccc(OC)c(c1)C(O)CN
: