Target
Alpha-1B adrenergic receptor
Ligand
BDBM50118702
Substrate
Meas. Tech.
ChEMBL_34627 (CHEMBL647272)
EC50
85000±n/a nM
Citation
 Altenbach, RJKhilevich, AMeyer, MDBuckner, SAMilicic, IDaza, AVBrune, MEO'Neill, ABGauvin, DMCain, JCNakane, MHolladay, MWWilliams, MBrioni, JDSullivan, JP N-[3-(1H-imidazol-4-ylmethyl)phenyl]ethanesulfonamide (ABT-866, 1),(1) a novel alpha(1)-adrenoceptor ligand with an enhanced in vitro and in vivo profile relative to phenylpropanolamine and midodrine. J Med Chem 45:4395-7 (2002)  
Target
Name:
Alpha-1B adrenergic receptor
Synonyms:
ADA1B_RAT Alpha 1B-adrenoceptor Alpha adrenergic receptor 1A and 1B Alpha-1Adrenoceptor Alpha-1B adrenoreceptor | adrenergic Alpha1B
Type:
G Protein-Coupled Receptor (GPCR)
Mol. Mass.:
56606.71
Organism:
Rattus norvegicus (rat)
Description:
Receptor binding assays were performed using rat cortical membranes.
Residue:
515
  
Inhibitor
Name:
BDBM50118702
Synonyms:
2-Amino-1-(2,5-dimethoxy-phenyl)-ethanol DESGLYMIDODRINE Proamatine
Type:
Small organic molecule
Emp. Form.:
C10H15NO3
Mol. Mass.:
197.231
SMILES:
COc1ccc(OC)c(c1)C(O)CN
: