Target
Tyrosine-protein phosphatase non-receptor type 1
Ligand
BDBM50118770
Substrate
Meas. Tech.
ChEMBL_162415 (CHEMBL772648)
Ki
9000±n/a nM
Citation
 Andersen, HSOlsen, OHIversen, LFSørensen, ALMortensen, SBChristensen, MSBranner, SHansen, TKLau, JFJeppesen, LMoran, EJSu, JBakir, FJudge, LShahbaz, MCollins, TVo, TNewman, MJRipka, WCMøller, NP Discovery and SAR of a novel selective and orally bioavailable nonpeptide classical competitive inhibitor class of protein-tyrosine phosphatase 1B. J Med Chem 45:4443-59 (2002)  
Target
Name:
Tyrosine-protein phosphatase non-receptor type 1
Synonyms:
PTN1_HUMAN PTPN1 Protein tyrosine phosphatase-1B (PTP1B) Protein-tyrosine phosphatase 1B (PTP1B) Tyrosine-protein phosphatase non-receptor type 1 (PTP1B)
Type:
Protein phosphatase
Mol. Mass.:
49963.76
Organism:
Homo sapiens (Human)
Description:
Human recombinant GST-fusion PTP1B (1-435).
Residue:
435
  
Inhibitor
Name:
BDBM50118770
Synonyms:
2-(Oxalyl-amino)-6-(2-thiophen-3-yl-ethyl)-4,5,6,7-tetrahydro-thieno[2,3-c]pyridine-3-carboxylic acid | CHEMBL341947
Type:
Small organic molecule
Emp. Form.:
C16H16N2O5S2
Mol. Mass.:
380.439
SMILES:
OC(=O)C(=O)Nc1sc2CN(CCc3ccsc3)CCc2c1C(O)=O
: