Target
Tyrosine-protein phosphatase non-receptor type 1
Ligand
BDBM50118786
Substrate
Meas. Tech.
ChEMBL_162283 (CHEMBL770981)
pH
5.5±n/a
Ki
700±n/a nM
Comments
extracted
Citation
 Andersen, HSOlsen, OHIversen, LFSørensen, ALMortensen, SBChristensen, MSBranner, SHansen, TKLau, JFJeppesen, LMoran, EJSu, JBakir, FJudge, LShahbaz, MCollins, TVo, TNewman, MJRipka, WCMøller, NP Discovery and SAR of a novel selective and orally bioavailable nonpeptide classical competitive inhibitor class of protein-tyrosine phosphatase 1B. J Med Chem 45:4443-59 (2002)  
Target
Name:
Tyrosine-protein phosphatase non-receptor type 1
Synonyms:
PTN1_HUMAN PTPN1 Protein tyrosine phosphatase-1B (PTP1B) Protein-tyrosine phosphatase 1B (PTP1B) Tyrosine-protein phosphatase non-receptor type 1 (PTP1B)
Type:
Protein phosphatase
Mol. Mass.:
49963.76
Organism:
Homo sapiens (Human)
Description:
Human recombinant GST-fusion PTP1B (1-435).
Residue:
435
  
Inhibitor
Name:
BDBM50118786
Synonyms:
6-(3-Methoxy-benzyl)-2-(oxalyl-amino)-4,5,6,7-tetrahydro-thieno[2,3-c]pyridine-3-carboxylic acid | CHEMBL137989
Type:
Small organic molecule
Emp. Form.:
C18H18N2O6S
Mol. Mass.:
390.41
SMILES:
COc1cccc(CN2CCc3c(C2)sc(NC(=O)C(O)=O)c3C(O)=O)c1
: