Target
Tyrosine-protein phosphatase non-receptor type 1
Ligand
BDBM50118796
Substrate
Meas. Tech.
ChEMBL_162283 (CHEMBL770981)
pH
5.5±n/a
Ki
8000±n/a nM
Comments
extracted
Citation
 Andersen, HSOlsen, OHIversen, LFSørensen, ALMortensen, SBChristensen, MSBranner, SHansen, TKLau, JFJeppesen, LMoran, EJSu, JBakir, FJudge, LShahbaz, MCollins, TVo, TNewman, MJRipka, WCMøller, NP Discovery and SAR of a novel selective and orally bioavailable nonpeptide classical competitive inhibitor class of protein-tyrosine phosphatase 1B. J Med Chem 45:4443-59 (2002)  
Target
Name:
Tyrosine-protein phosphatase non-receptor type 1
Synonyms:
PTN1_HUMAN PTPN1 Protein tyrosine phosphatase-1B (PTP1B) Protein-tyrosine phosphatase 1B (PTP1B) Tyrosine-protein phosphatase non-receptor type 1 (PTP1B)
Type:
Protein phosphatase
Mol. Mass.:
49963.76
Organism:
Homo sapiens (Human)
Description:
Human recombinant GST-fusion PTP1B (1-435).
Residue:
435
  
Inhibitor
Name:
BDBM50118796
Synonyms:
6-(OXALYL-AMINO)-1H-INDOLE-5-CARBOXYLIC ACID CHEMBL342478
Type:
Small organic molecule
Emp. Form.:
C11H8N2O5
Mol. Mass.:
248.1916
SMILES:
OC(=O)C(=O)Nc1cc2[nH]ccc2cc1C(O)=O
: