Target
Potassium channel subfamily T member 1
Ligand
BDBM50557652
Substrate
Meas. Tech.
ChEMBL_2059777 (CHEMBL4714778)
IC50
167±n/a nM
Citation
 Griffin, AMKahlig, KMHatch, RJHughes, ZAChapman, MLAntonio, BMarron, BEWittmann, MMartinez-Botella, G Discovery of the First Orally Available, Selective K ACS Med Chem Lett 12:593-602 (2021)  
Target
Name:
Potassium channel subfamily T member 1
Synonyms:
KCNT1 KCa4.1 Potassium channel subfamily T member 1
Type:
PROTEIN
Mol. Mass.:
138357.73
Organism:
Homo sapiens
Description:
ChEMBL_120153
Residue:
1230
  
Inhibitor
Name:
BDBM50557652
Synonyms:
CHEMBL4793291
Type:
Small organic molecule
Emp. Form.:
C19H21N5O2
Mol. Mass.:
351.4023
SMILES:
C[C@H](NC(=O)c1cc(nn1C)C1CC1)c1nc(no1)-c1cccc(C)c1
: