Target
Potassium channel subfamily T member 1
Ligand
BDBM50557673
Substrate
Meas. Tech.
ChEMBL_2059777 (CHEMBL4714778)
IC50
573±n/a nM
Citation
 Griffin, AMKahlig, KMHatch, RJHughes, ZAChapman, MLAntonio, BMarron, BEWittmann, MMartinez-Botella, G Discovery of the First Orally Available, Selective K ACS Med Chem Lett 12:593-602 (2021)  
Target
Name:
Potassium channel subfamily T member 1
Synonyms:
KCNT1 KCa4.1 Potassium channel subfamily T member 1
Type:
PROTEIN
Mol. Mass.:
138357.73
Organism:
Homo sapiens
Description:
ChEMBL_120153
Residue:
1230
  
Inhibitor
Name:
BDBM50557673
Synonyms:
CHEMBL4781553
Type:
Small organic molecule
Emp. Form.:
C19H20F3N7O2
Mol. Mass.:
435.403
SMILES:
C[C@H](NC(=O)c1cc(nn1C)C(F)(F)F)c1nc(no1)-c1ccnc(c1)N1CCCC1
: