Target
Potassium channel subfamily T member 1
Ligand
BDBM50557680
Substrate
Meas. Tech.
ChEMBL_2059783 (CHEMBL4714784)
IC50
545±n/a nM
Citation
 Griffin, AMKahlig, KMHatch, RJHughes, ZAChapman, MLAntonio, BMarron, BEWittmann, MMartinez-Botella, G Discovery of the First Orally Available, Selective K ACS Med Chem Lett 12:593-602 (2021)  
Target
Name:
Potassium channel subfamily T member 1
Synonyms:
KCNT1_RAT Potassium channel subfamily T member 1 Slack
Type:
PROTEIN
Mol. Mass.:
139628.43
Organism:
Rattus norvegicus
Description:
ChEMBL_120173
Residue:
1237
  
Inhibitor
Name:
BDBM50557680
Synonyms:
CHEMBL4741793
Type:
Small organic molecule
Emp. Form.:
C16H12F6N6O2
Mol. Mass.:
434.2959
SMILES:
C[C@H](NC(=O)c1cc(nn1C)C(F)(F)F)c1nc(no1)-c1ccnc(c1)C(F)(F)F
: