Target
Inosine-5'-monophosphate dehydrogenase 2
Ligand
BDBM50119024
Substrate
Meas. Tech.
ChEBML_88710
IC50
>1000±n/a nM
Citation
 Watterson, SHLiu, CDhar, TGGu, HHPitts, WJBarrish, JCFleener, CARouleau, KSherbina, NZHollenbaugh, DLIwanowicz, EJ Novel amide-based inhibitors of inosine 5'-monophosphate dehydrogenase. Bioorg Med Chem Lett 12:2879-82 (2002)  
Target
Name:
Inosine-5'-monophosphate dehydrogenase 2
Synonyms:
IMDH2_HUMAN IMPD 2 IMPDH-II Inosine 5'-monophosphate dehydrogenase II (IMPDH II) Inosine-5 -monophosphate dehydrogenase 2 | Inosine-5'-monophosphate dehydrogenase (IMPDH)
Type:
Enzyme
Mol. Mass.:
55806.87
Organism:
Homo sapiens (Human)
Description:
Recombinant IMPDH2 expressed in E. coli.
Residue:
514
  
Inhibitor
Name:
BDBM50119024
Synonyms:
3-Methyl-furan-2-carboxylic acid (3-methoxy-4-oxazol-5-yl-phenyl)-amide | CHEMBL318941
Type:
Small organic molecule
Emp. Form.:
C16H14N2O4
Mol. Mass.:
298.2934
SMILES:
COc1cc(NC(=O)c2occc2C)ccc1-c1cnco1
: