Target
Inosine-5'-monophosphate dehydrogenase 2
Ligand
BDBM50119112
Substrate
Meas. Tech.
ChEMBL_89935 (CHEMBL699561)
IC50
1500±n/a nM
Citation
 Iwanowicz, EJWatterson, SHLiu, CGu, HHMitt, TLeftheris, KBarrish, JCFleener, CARouleau, KSherbina, NZHollenbaugh, DL Novel guanidine-based inhibitors of inosine monophosphate dehydrogenase. Bioorg Med Chem Lett 12:2931-4 (2002)  
Target
Name:
Inosine-5'-monophosphate dehydrogenase 2
Synonyms:
IMDH2_HUMAN IMPD 2 IMPDH-II Inosine 5'-monophosphate dehydrogenase II (IMPDH II) Inosine-5 -monophosphate dehydrogenase 2 | Inosine-5'-monophosphate dehydrogenase (IMPDH)
Type:
Enzyme
Mol. Mass.:
55806.87
Organism:
Homo sapiens (Human)
Description:
Recombinant IMPDH2 expressed in E. coli.
Residue:
514
  
Inhibitor
Name:
BDBM50119112
Synonyms:
CHEMBL98700 | N''-cyano-N-[3-methoxy-4-(1,3-oxazol-5-yl)phenyl]-N'-(4-methylphenyl)guanidine
Type:
Small organic molecule
Emp. Form.:
C19H17N5O2
Mol. Mass.:
347.3706
SMILES:
COc1cc(NC(Nc2ccc(C)cc2)=NC#N)ccc1-c1cnco1
: