Target
Inosine-5'-monophosphate dehydrogenase 2
Ligand
BDBM50119117
Substrate
Meas. Tech.
ChEMBL_88707 (CHEMBL873223)
IC50
>3000±n/a nM
Citation
 Iwanowicz, EJWatterson, SHLiu, CGu, HHMitt, TLeftheris, KBarrish, JCFleener, CARouleau, KSherbina, NZHollenbaugh, DL Novel guanidine-based inhibitors of inosine monophosphate dehydrogenase. Bioorg Med Chem Lett 12:2931-4 (2002)  
Target
Name:
Inosine-5'-monophosphate dehydrogenase 2
Synonyms:
IMDH2_HUMAN IMPD 2 IMPDH-II Inosine 5'-monophosphate dehydrogenase II (IMPDH II) Inosine-5 -monophosphate dehydrogenase 2 | Inosine-5'-monophosphate dehydrogenase (IMPDH)
Type:
Enzyme
Mol. Mass.:
55806.87
Organism:
Homo sapiens (Human)
Description:
Recombinant IMPDH2 expressed in E. coli.
Residue:
514
  
Inhibitor
Name:
BDBM50119117
Synonyms:
CHEMBL98215 | N-(3-Methoxy-4-oxazol-5-yl-phenyl)-N'-m-tolyl-guanidine
Type:
Small organic molecule
Emp. Form.:
C18H18N4O2
Mol. Mass.:
322.3611
SMILES:
COc1cc(ccc1-c1cnco1)N=C(N)Nc1cccc(C)c1
: