Target
Adenosine receptor A2a
Ligand
BDBM50009546
Substrate
Meas. Tech.
ChEMBL_32127 (CHEMBL643707)
IC50
23±n/a nM
Citation
 Palle, VPElzein, EOGothe, SALi, ZGao, ZMeyer, SBlackburn, BZablocki, JA Structure-affinity relationships of the affinity of 2-pyrazolyl adenosine analogues for the adenosine A2A receptor. Bioorg Med Chem Lett 12:2935-9 (2002)  
Target
Name:
Adenosine receptor A2a
Synonyms:
AA2AR_RAT Adenosine A2 receptor Adenosine Receptors A2a (A2a) Adenosine receptors A2a Rat striatal adenosine A2a receptor
Type:
G Protein-Coupled Receptor (GPCR)
Mol. Mass.:
45015.65
Organism:
Rattus norvegicus (rat)
Description:
Rat A2A receptors expressed in CHO cells.
Residue:
410
  
Inhibitor
Name:
BDBM50009546
Synonyms:
2-{6-Amino-2-[2-(4-methoxy-phenyl)-ethylamino]-purin-9-yl}-5-hydroxymethyl-tetrahydro-furan-3,4-diol CHEMBL98637
Type:
Small organic molecule
Emp. Form.:
C19H24N6O5
Mol. Mass.:
416.4311
SMILES:
COc1ccc(CCNc2nc(N)c3ncn([C@@H]4O[C@H](CO)[C@@H](O)[C@H]4O)c3n2)cc1
: