Target
Beta-1 adrenergic receptor
Ligand
BDBM50119183
Substrate
Meas. Tech.
ChEMBL_37662 (CHEMBL651255)
IC50
27±n/a nM
Citation
 Steffan, RJAshwell, MASolvibile, WRMatelan, ELargis, EHan, STillet, JMulvey, R Novel substituted 4-aminomethylpiperidines as potent and selective human beta3-agonists. Part 1: aryloxypropanolaminomethylpiperidines. Bioorg Med Chem Lett 12:2957-61 (2002)  
Target
Name:
Beta-1 adrenergic receptor
Synonyms:
ADRB1 ADRB1_HUMAN Beta-1 adrenoceptor | adrenergic Beta1
Type:
G Protein-Coupled Receptor (GPCR)
Mol. Mass.:
51338.40
Organism:
Homo sapiens (Human)
Description:
P08588
Residue:
477
  
Inhibitor
Name:
BDBM50119183
Synonyms:
1-[4-(4-{[(S)-2-Hydroxy-3-(4-hydroxy-phenoxy)-propylamino]-methyl}-piperidine-1-sulfonyl)-phenyl]-3-octyl-urea | CHEMBL102194
Type:
Small organic molecule
Emp. Form.:
C30H46N4O6S
Mol. Mass.:
590.774
SMILES:
CCCCCCCCNC(=O)Nc1ccc(cc1)S(=O)(=O)N1CCC(CNC[C@H](O)COc2ccc(O)cc2)CC1
: