Target
Caspase-1
Ligand
BDBM50119218
Substrate
Meas. Tech.
ChEMBL_46520 (CHEMBL659314)
IC50
6.5±n/a nM
Citation
 Linton, SDKaranewsky, DSTernansky, RJWu, JCPham, BKodandapani, LSmidt, RDiaz, JLFritz, LCTomaselli, KJ Acyl dipeptides as reversible caspase inhibitors. Part 1: initial lead optimization. Bioorg Med Chem Lett 12:2969-71 (2002)  
Target
Name:
Caspase-1
Synonyms:
CASP1 Caspase ICE IL1BCE Interleukin-1 beta-converting enzyme
Type:
Enzyme
Mol. Mass.:
45154.13
Organism:
Homo sapiens (Human)
Description:
P29466
Residue:
404
  
Inhibitor
Name:
BDBM50119218
Synonyms:
4-Benzyloxycarbonylamino-4-[1-(2-hydroxy-5-oxo-tetrahydro-furan-3-ylcarbamoyl)-3-methyl-butylcarbamoyl]-butyric acid | CHEMBL100588
Type:
Small organic molecule
Emp. Form.:
C23H31N3O9
Mol. Mass.:
493.5069
SMILES:
CC(C)C[C@H](NC(=O)[C@H](CCC(O)=O)NC(=O)OCc1ccccc1)C(=O)N[C@H]1CC(=O)OC1O
: