Target
Caspase-7
Ligand
BDBM50119245
Substrate
Meas. Tech.
ChEMBL_46846 (CHEMBL657313)
IC50
10±n/a nM
Citation
 Linton, SDKaranewsky, DSTernansky, RJWu, JCPham, BKodandapani, LSmidt, RDiaz, JLFritz, LCTomaselli, KJ Acyl dipeptides as reversible caspase inhibitors. Part 1: initial lead optimization. Bioorg Med Chem Lett 12:2969-71 (2002)  
Target
Name:
Caspase-7
Synonyms:
Apoptotic protease Mch-3 CASP7 CMH-1 MCH3 | caspase 7, apoptosis-related cysteine peptidase
Type:
Enzyme
Mol. Mass.:
34273.91
Organism:
Homo sapiens (Human)
Description:
P55210
Residue:
303
  
Inhibitor
Name:
BDBM50119245
Synonyms:
4-(2-Acetylamino-2-carboxy-acetylamino)-4-[1-(2-hydroxy-5-oxo-tetrahydro-furan-3-ylcarbamoyl)-2-methyl-propylcarbamoyl]-butyric acid | CHEMBL328412
Type:
Small organic molecule
Emp. Form.:
C19H28N4O11
Mol. Mass.:
488.4458
SMILES:
CC(C)[C@H](NC(=O)[C@H](CCC(O)=O)NC(=O)[C@@H](NC(C)=O)C(O)=O)C(=O)N[C@H]1CC(=O)OC1O
: