Target
Caspase-8
Ligand
BDBM50119264
Substrate
Meas. Tech.
ChEMBL_46862 (CHEMBL659710)
IC50
12±n/a nM
Citation
 Linton, SDKaranewsky, DSTernansky, RJChen, NGuo, XJahangiri, KGKalish, VJMeduna, SPRobinson, EDUllman, BRWu, JCPham, BKodandapani, LSmidt, RDiaz, JLFritz, LCvon Krosigk, URoggo, SSchmitz, ATomaselli, KJ Acyl dipeptides as reversible caspase inhibitors. Part 2: further optimization. Bioorg Med Chem Lett 12:2973-5 (2002)  
Target
Name:
Caspase-8
Synonyms:
Apoptotic cysteine protease CAP4 CASP8 Caspase Caspase-8 subunit p18 FADD-like ICE ICE-like apoptotic protease 5 MCH5 | MORT1-associated CED-3 homolog
Type:
Enzyme
Mol. Mass.:
55373.89
Organism:
Homo sapiens (Human)
Description:
Q14790
Residue:
479
  
Inhibitor
Name:
BDBM50119264
Synonyms:
4-[1-(2-Hydroxy-5-oxo-tetrahydro-furan-3-ylcarbamoyl)-3-methyl-butylcarbamoyl]-4-(naphthalen-1-yloxy)-butyric acid | CHEMBL100643
Type:
Small organic molecule
Emp. Form.:
C25H30N2O8
Mol. Mass.:
486.5143
SMILES:
CC(C)CC(NC(=O)[C@@H](CCC(O)=O)Oc1cccc2ccccc12)C(=O)N[C@H]1CC(=O)OC1O
: