Target
Sodium-dependent serotonin transporter
Ligand
BDBM50073436
Substrate
Meas. Tech.
ChEMBL_198051 (CHEMBL805178)
Ki
0.097±n/a nM
Citation
 Oya, SChoi, SRCoenen, HKung, HF New PET imaging agent for the serotonin transporter: [(18)F]ACF (2-[(2-amino-4-chloro-5-fluorophenyl)thio]-N,N-dimethyl-benzenmethanamine). J Med Chem 45:4716-23 (2002)  
Target
Name:
Sodium-dependent serotonin transporter
Synonyms:
5-HT Transporter 5HT transporter Anandamid membrane transporter, AMT Monoamine transporters; Norepinephrine & serotonin Slc6a4 Sodium-dependent serotonin transporter (SERT) | imipramine receptor
Type:
Multi-pass membrane protein
Mol. Mass.:
70168.43
Organism:
Rattus norvegicus (rat)
Description:
P31652
Residue:
630
  
Inhibitor
Name:
BDBM50073436
Synonyms:
(2-(2-((dimethylamino)methyl)phenylthio)-5-iodophenyl)methanol CHEMBL2314219 | [2-(2-Dimethylaminomethyl-phenylsulfanyl)-5-iodo-phenyl]-methanol
Type:
Small organic molecule
Emp. Form.:
C16H18INOS
Mol. Mass.:
399.29
SMILES:
CN(C)Cc1ccccc1Sc1ccc(I)cc1CO
: