Target
Sodium-dependent dopamine transporter
Ligand
BDBM50110577
Substrate
Meas. Tech.
ChEMBL_62625 (CHEMBL678247)
Ki
699±n/a nM
Citation
 Oya, SChoi, SRCoenen, HKung, HF New PET imaging agent for the serotonin transporter: [(18)F]ACF (2-[(2-amino-4-chloro-5-fluorophenyl)thio]-N,N-dimethyl-benzenmethanamine). J Med Chem 45:4716-23 (2002)  
Target
Name:
Sodium-dependent dopamine transporter
Synonyms:
DA transporter SC6A3_RAT Sodium-dependent dopamine transporter | Sodium-dependent dopamine transporter (DAT)
Type:
Multi-pass membrane protein
Mol. Mass.:
68749.45
Organism:
Rattus norvegicus (rat)
Description:
P23977
Residue:
619
  
Inhibitor
Name:
BDBM50110577
Synonyms:
2-(2-((dimethylamino)methyl)phenylthio)-5-iodoaniline CHEMBL23034 | CHEMBL2314218
Type:
Small organic molecule
Emp. Form.:
C15H17IN2S
Mol. Mass.:
384.278
SMILES:
CN(C)Cc1ccccc1Sc1ccc(I)cc1N
: