Target
Inosine-5'-monophosphate dehydrogenase 2
Ligand
BDBM50120001
Substrate
Meas. Tech.
ChEBML_88592
IC50
110±n/a nM
Citation
 Dhar, TGLiu, CPitts, WJGuo, JWatterson, SHGu, HFleener, CARouleau, KSherbina, NZBarrish, JCHollenbaugh, DIwanowicz, EJ A survey of cyclic replacements for the central diamide moiety of inhibitors of inosine monophosphate dehydrogenase. Bioorg Med Chem Lett 12:3125-8 (2002)  
Target
Name:
Inosine-5'-monophosphate dehydrogenase 2
Synonyms:
IMDH2_HUMAN IMPD 2 IMPDH-II Inosine 5'-monophosphate dehydrogenase II (IMPDH II) Inosine-5 -monophosphate dehydrogenase 2 | Inosine-5'-monophosphate dehydrogenase (IMPDH)
Type:
Enzyme
Mol. Mass.:
55806.87
Organism:
Homo sapiens (Human)
Description:
Recombinant IMPDH2 expressed in E. coli.
Residue:
514
  
Inhibitor
Name:
BDBM50120001
Synonyms:
(3-Methoxy-4-oxazol-5-yl-phenyl)-(4-methoxy-6-phenyl-pyrimidin-2-yl)-amine | CHEMBL104313
Type:
Small organic molecule
Emp. Form.:
C21H18N4O3
Mol. Mass.:
374.3926
SMILES:
COc1cc(nc(Nc2ccc(-c3cnco3)c(OC)c2)n1)-c1ccccc1
: