Target
Inosine-5'-monophosphate dehydrogenase 2
Ligand
BDBM50112573
Substrate
Meas. Tech.
ChEBML_88592
IC50
52.0±n/a nM
Citation
 Dhar, TGLiu, CPitts, WJGuo, JWatterson, SHGu, HFleener, CARouleau, KSherbina, NZBarrish, JCHollenbaugh, DIwanowicz, EJ A survey of cyclic replacements for the central diamide moiety of inhibitors of inosine monophosphate dehydrogenase. Bioorg Med Chem Lett 12:3125-8 (2002)  
Target
Name:
Inosine-5'-monophosphate dehydrogenase 2
Synonyms:
IMDH2_HUMAN IMPD 2 IMPDH-II Inosine 5'-monophosphate dehydrogenase II (IMPDH II) Inosine-5 -monophosphate dehydrogenase 2 | Inosine-5'-monophosphate dehydrogenase (IMPDH)
Type:
Enzyme
Mol. Mass.:
55806.87
Organism:
Homo sapiens (Human)
Description:
Recombinant IMPDH2 expressed in E. coli.
Residue:
514
  
Inhibitor
Name:
BDBM50112573
Synonyms:
CHEMBL283256 N-(3-Methoxy-4-oxazol-5-yl-phenyl)-N'-phenyl-oxalamide
Type:
Small organic molecule
Emp. Form.:
C18H15N3O4
Mol. Mass.:
337.3294
SMILES:
COc1cc(NC(=O)C(=O)Nc2ccccc2)ccc1-c1cnco1
: