Target
Retinoic acid receptor alpha
Ligand
BDBM50052414
Substrate
Meas. Tech.
ChEMBL_32960 (CHEMBL644524)
Kd
36±n/a nM
Citation
 Beard, RLDuong, TTTeng, MKlein, ESStandevan, AMChandraratna, RA Synthesis and biological activity of retinoic acid receptor-alpha specific amides. Bioorg Med Chem Lett 12:3145-8 (2002)  
Target
Name:
Retinoic acid receptor alpha
Synonyms:
NR1B1 RAR-alpha RARA_HUMAN Retinoic acid receptor alpha/Retinoid X receptor alpha Retinoid receptor
Type:
PROTEIN
Mol. Mass.:
50778.87
Organism:
Homo sapiens (Human)
Description:
ChEMBL_1466191
Residue:
462
  
Inhibitor
Name:
BDBM50052414
Synonyms:
4-(1,1,4,4-tetramethyl-1,2,3,4-tetrahydronaphthalene-7-carboxamido)benzoic acid 4-[(5,5,8,8-Tetramethyl-5,6,7,8-tetrahydro-naphthalene-2-carbonyl)-amino]-benzoic acid CHEMBL69367 | US9963439, AM580
Type:
Small organic molecule
Emp. Form.:
C22H25NO3
Mol. Mass.:
351.4388
SMILES:
CC1(C)CCC(C)(C)c2cc(ccc12)C(=O)Nc1ccc(cc1)C(O)=O
: