Target
Prothrombin
Ligand
BDBM50120225
Substrate
Meas. Tech.
ChEMBL_207968 (CHEMBL815795)
IC50
0.008000±n/a nM
Citation
 Iwanowicz, EJKimball, SDLin, JLau, WHan, WCWang, TCRoberts, DGSchumacher, WAOgletree, MLSeiler, SM Retro-binding thrombin active site inhibitors: identification of an orally active inhibitor of thrombin catalytic activity. Bioorg Med Chem Lett 12:3183-6 (2002)  
Target
Name:
Prothrombin
Synonyms:
Activation peptide fragment 1 Coagulation factor II Prothrombin precursor Thrombin heavy chain | Thrombin light chain
Type:
Protein
Mol. Mass.:
70029.57
Organism:
Homo sapiens (Human)
Description:
P00734
Residue:
622
  
Inhibitor
Name:
BDBM50120225
Synonyms:
2-{[2-(4-Guanidino-butyrylamino)-3-(4-nitro-phenyl)-propionyl]-methyl-amino}-3-hydroxy-N-(1-phenyl-ethyl)-butyramide | CHEMBL105819
Type:
Small organic molecule
Emp. Form.:
C27H37N7O6
Mol. Mass.:
555.626
SMILES:
CC(O)C(N(C)C(=O)C(Cc1ccc(cc1)[N+]([O-])=O)NC(=O)CCC[N-]C(N)=[NH2+])C(=O)NC(C)c1ccccc1
: